Not logged in. · Lost password · Register

All posts by Broxxa (1)

topic: AVR Studio zuhause  in the forum: 2. Semester Grundlagen der systemnahen Programmierung in C
Broxxa
Member since Jan 2012
1 post
Hallo,

Ich bekomme stets folgende Fehlermeldung:

------ Build started: Project: aufgabe3, Configuration: Debug AVR ------
Build started.
Project "aufgabe3.cproj" (default targets):
Target "PreBuildEvent" skipped, due to false condition; ('$(PreBuildEvent)'!='') was evaluated as (''!='').
Target "CoreBuild" in file "C:\Program Files (x86)\Atmel\AVR Studio 5.1\Vs\Compiler.targets" from project "C:\Users\Sven\Documents\AVRStudio 5.1\aufgabe3\aufgabe3\aufgabe3.cproj" (target "Build" depends on it):
    Using "RunCompilerTask" task from assembly "C:\Program Files (x86)\Atmel\AVR Studio 5.1\Vs\Compiler.Task.dll".
    Task "RunCompilerTask"
        C:\Program Files (x86)\Atmel\AVR Studio 5.1\make\make.exe all
        cc1.exe: warnings being treated as errors
C:\Users\Sven\Documents\AVRStudio 5.1\aufgabe3\aufgabe3\gesch.c(7,2): #import is a GCC extension
gesch.c
        Invoking: AVR/GNU C Compiler
        "C:\Program Files (x86)\Atmel\AVR Studio 5.1\extensions\Atmel\AVRGCC\3.3.1.27\AVRToolchain\bin\avr-gcc.exe"  -I"../../../../Libspicboard"  -O0 -g3 -Wall -Werror -pedantic -c -std=c99 -ffreestanding -DF_CPU=1000000UL -MD -MP -MF "gesch.d" -MT"gesch.d"  -mmcu=atmega32  -o"gesch.o" ".././gesch.c"
        make: *** [gesch.o] Error 1
    Done executing task "RunCompilerTask" -- FAILED.
Done building target "CoreBuild" in project "aufgabe3.cproj" -- FAILED.
Done building project "aufgabe3.cproj" -- FAILED.

Build FAILED.
========== Build: 0 succeeded or up-to-date, 1 failed, 0 skipped ==========


Könnte mir hier eventuell jemand weiterhelfen das zu beheben?

Danke schon einmal im Vorraus.

Gruß
Close Smaller – Larger + Reply to this post:
Special characters:
Go to forum
Powered by the Unclassified NewsBoard software, 20110527-dev, © 2003-8 by Yves Goergen